Rulati comanda cu:
Mesaje: 899
Membru din: 11 Feb 2025, 17:10
Status: Pierd vremea ^.^
ID: test1 defapt e admin
PW: 123456
Ingame (Player):
Code:
ID: test2 defapt e admin2
PW: 123456
PW: 123456
Ingame (Player):
Code:
ID: test2 defapt e admin2
PW: 123456
Mesaje: 2
Membru din: 30 Sep 2024, 17:46
Status: La MT2
Server: Rotex2
g++12: fatal error: Killed signal terminated program cc1plus
compilation terminated.
gmake[1]: *** [Makefile:164: .obj/char_battle.o] Error 1
gmake[1]: *** Waiting for unfinished jobs....
gmake[1]: Leaving directory '/usr/src/Source/Server/game/src'
gmake: *** [Makefile:115: all] Error 2
Primesc eroarea asta la gmake
compilation terminated.
gmake[1]: *** [Makefile:164: .obj/char_battle.o] Error 1
gmake[1]: *** Waiting for unfinished jobs....
gmake[1]: Leaving directory '/usr/src/Source/Server/game/src'
gmake: *** [Makefile:115: all] Error 2
Primesc eroarea asta la gmake
Am rezolvat cu asta, acum primesc alta eroare:AjMER scrie: ↑ g++12: fatal error: Killed signal terminated program cc1plus
compilation terminated.
gmake[1]: *** [Makefile:164: .obj/char_battle.o] Error 1
gmake[1]: *** Waiting for unfinished jobs....
gmake[1]: Leaving directory '/usr/src/Source/Server/game/src'
gmake: *** [Makefile:115: all] Error 2
Primesc eroarea asta la gmake
/usr/local/bin/ld: skipping incompatible /usr/local/lib/gcc12/gcc/x86_64-portbld-freebsd13.5/12.4.0/../../../libstdc++.so when searching for -lstdc++
/usr/local/bin/ld: skipping incompatible /usr/local/lib/gcc12/gcc/x86_64-portbld-freebsd13.5/12.4.0/../../../libstdc++.a when searching for -lstdc++
/usr/local/bin/ld: cannot find -lstdc++: No such file or directory
/usr/local/bin/ld: skipping incompatible /usr/local/lib/gcc12/gcc/x86_64-portbld-freebsd13.5/12.4.0/../../../libstdc++.so when searching for -lstdc++
collect2: error: ld returned 1 exit status
gmake[1]: *** [Makefile:175: ../game_r41251] Error 1
gmake[1]: Leaving directory '/usr/src/Source/Server/game/src'
gmake: *** [Makefile:115: all] Error 2
Mesaje: 899
Membru din: 11 Feb 2025, 17:10
Status: Pierd vremea ^.^
Trebuie să ai vdi cu FreeBSD 13.2 (32-bit)AjMER scrie: ↑Am rezolvat cu asta, acum primesc alta eroare:AjMER scrie: ↑ g++12: fatal error: Killed signal terminated program cc1plus
compilation terminated.
gmake[1]: *** [Makefile:164: .obj/char_battle.o] Error 1
gmake[1]: *** Waiting for unfinished jobs....
gmake[1]: Leaving directory '/usr/src/Source/Server/game/src'
gmake: *** [Makefile:115: all] Error 2
Primesc eroarea asta la gmake
/usr/local/bin/ld: skipping incompatible /usr/local/lib/gcc12/gcc/x86_64-portbld-freebsd13.5/12.4.0/../../../libstdc++.so when searching for -lstdc++
/usr/local/bin/ld: skipping incompatible /usr/local/lib/gcc12/gcc/x86_64-portbld-freebsd13.5/12.4.0/../../../libstdc++.a when searching for -lstdc++
/usr/local/bin/ld: cannot find -lstdc++: No such file or directory
/usr/local/bin/ld: skipping incompatible /usr/local/lib/gcc12/gcc/x86_64-portbld-freebsd13.5/12.4.0/../../../libstdc++.so when searching for -lstdc++
collect2: error: ld returned 1 exit status
gmake[1]: *** [Makefile:175: ../game_r41251] Error 1
gmake[1]: Leaving directory '/usr/src/Source/Server/game/src'
gmake: *** [Makefile:115: all] Error 2
Ultima oară modificat 04 Sep 2025, 22:09 de către Andi, modificat 1 dată în total.
Mesaje: 899
Membru din: 11 Feb 2025, 17:10
Status: Pierd vremea ^.^
Ai nevoie de acest fix:AjMER scrie: ↑ g++12: fatal error: Killed signal terminated program cc1plus
compilation terminated.
gmake[1]: *** [Makefile:164: .obj/char_battle.o] Error 1
gmake[1]: *** Waiting for unfinished jobs....
gmake[1]: Leaving directory '/usr/src/Source/Server/game/src'
gmake: *** [Makefile:115: all] Error 2
Primesc eroarea asta la gmake
Mesaje: 13
Membru din: 03 Oct 2024, 11:58
Status: Pierd vremea ^.^
Salutare voua va merge pick up??
Mesaje: 62
Membru din: 19 Oct 2024, 04:54
Status: Pierd vremea ^.^
Server: Alpha
nu are freebsd in fisier
Lib pls?
ld-elf32.so.1: /usr/lib32/libstdc++.so.6: version GLIBCXX_3.4.22 required by /usr/home/m2_svfiles/main/srv1/share/bin/game not found
ld-elf32.so.1: /usr/lib32/libstdc++.so.6: version GLIBCXX_3.4.26 required by /usr/home/m2_svfiles/main/srv1/share/bin/db not found
ld-elf32.so.1: /usr/lib32/libstdc++.so.6: version GLIBCXX_3.4.22 required by /usr/home/m2_svfiles/main/srv1/share/bin/game not found
ld-elf32.so.1: /usr/lib32/libstdc++.so.6: version GLIBCXX_3.4.26 required by /usr/home/m2_svfiles/main/srv1/share/bin/db not found
Discord ID copiat:

la acest mesaj și conținutul se va afișa automat.

